Target
MAP kinase-interacting serine/threonine-protein kinase 2
Ligand
BDBM31317
Substrate
Meas. Tech.
Inhibition Assay
pH
7.4±n/a
Temperature
303.15±n/a K
IC50
26±n/a nM
Comments
extracted
Citation
 Heckel, AHimmelsbach, FKley, JLehmann-Lintz, TRedemann, NSauer, AThomas, LWiedenmayer, DBlack, PBlackaby, WLinney, IAusten, MDanilewicz, JSchneider, MSchreiter, K Thienopyrimidines containing a substituted alkyl group for pharmaceutical compositions US Patent  US8853193 Publication Date 10/7/2014 
Target
Name:
MAP kinase-interacting serine/threonine-protein kinase 2
Synonyms:
GPRK7 MAP kinase-interacting serine/threonine-protein kinase 2 (MKNK2) MAP-kinase interacting kinase 2 (MNK2) MKNK2_HUMAN | MNK2
Type:
Protein
Mol. Mass.:
51870.79
Organism:
Homo sapiens (Human)
Description:
Q9HBH9
Residue:
465
  
Inhibitor
Name:
BDBM31317
Synonyms:
US8853193, 32-38
Type:
Emp. Form.:
C22H25F4N5O2S
Mol. Mass.:
499.525
SMILES:
CN(C)CCCNC(=O)c1sc2ncnc(Nc3ccc(F)cc3OCCC(F)(F)F)c2c1C
: