Target
MAP kinase-interacting serine/threonine-protein kinase 2
Ligand
BDBM136230
Substrate
Meas. Tech.
Inhibition Assay
pH
7.4±n/a
Temperature
303.15±n/a K
IC50
42±n/a nM
Comments
extracted
Citation
 Heckel, AHimmelsbach, FKley, JLehmann-Lintz, TRedemann, NSauer, AThomas, LWiedenmayer, DBlack, PBlackaby, WLinney, IAusten, MDanilewicz, JSchneider, MSchreiter, K Thienopyrimidines containing a substituted alkyl group for pharmaceutical compositions US Patent  US8853193 Publication Date 10/7/2014 
Target
Name:
MAP kinase-interacting serine/threonine-protein kinase 2
Synonyms:
GPRK7 MAP kinase-interacting serine/threonine-protein kinase 2 (MKNK2) MAP-kinase interacting kinase 2 (MNK2) MKNK2_HUMAN | MNK2
Type:
Protein
Mol. Mass.:
51870.79
Organism:
Homo sapiens (Human)
Description:
Q9HBH9
Residue:
465
  
Inhibitor
Name:
BDBM136230
Synonyms:
US8853193, 36-2
Type:
Small organic molecule
Emp. Form.:
C20H25N5O3S
Mol. Mass.:
415.509
SMILES:
CC(C)Oc1ncccc1Nc1ncnc2sc(C(=O)NCCCCO)c(C)c12
: