Target
5-hydroxytryptamine receptor 1A
Ligand
BDBM136338
Substrate
Meas. Tech.
Inhibition Assay
pH
7.4±n/a
Ki
0.42±n/a nM
Comments
extracted
Citation
 Andersson, JGyback, HJohansson, ALinde, CEMalmstrom, JNordvall, GWeigelt, TTerp, G 2-carboxamide-7-piperazinyl-benzofuran derivatives US Patent  US8859534 Publication Date 10/14/2014 
Target
Name:
5-hydroxytryptamine receptor 1A
Synonyms:
5-hydroxytryptamine receptor 1A (5HT1A)
Type:
Protein
Mol. Mass.:
46351.20
Organism:
Cricetulus griseus (Chinese hamster) (Cricetulus barabensis griseus)
Description:
G3I1B6
Residue:
422
  
Inhibitor
Name:
BDBM136338
Synonyms:
US8859534, 24
Type:
Small organic molecule
Emp. Form.:
C31H36N6O3
Mol. Mass.:
540.6559
SMILES:
COc1cccnc1N1CCC(CC1)NC(=O)c1cc2cccc(N3CCN(CCc4ccccn4)CC3)c2o1
: