Target
Regulator of G-protein signaling 16
Ligand
BDBM50384774
Substrate
Meas. Tech.
Inhibitory Assay
IC50
3500±n/a nM
Citation
 Neubig, RBlazer, LHusbands, SLarsen, STraynor, J Small molecule inhibitors of RGS proteins US Patent  US8865750 Publication Date 10/21/2014 
Target
Name:
Regulator of G-protein signaling 16
Synonyms:
RGS16 RGSR regulator of G-protein signalling 16
Type:
Enzyme Catalytic Domain
Mol. Mass.:
22748.87
Organism:
Homo sapiens (Human)
Description:
gi_156416009
Residue:
202
  
Inhibitor
Name:
BDBM50384774
Synonyms:
CHEMBL1917204 | US20230414581, Compound 6
Type:
Small organic molecule
Emp. Form.:
C16H13FN2O2S
Mol. Mass.:
316.35
SMILES:
Cc1ccc(cc1)-n1sc(=O)n(Cc2ccc(F)cc2)c1=O
: