Target
High affinity nerve growth factor receptor
Ligand
BDBM136670
Substrate
Meas. Tech.
ELISA Assay
pH
7.5±n/a
IC50
14.6±n/a nM
Citation
 Haas, JAndrews, SWJiang, YZhang, G Method of treatment using substituted pyrazolo[1,5-a]pyrimidine compounds US Patent  US8865698 Publication Date 10/21/2014 
Target
Name:
High affinity nerve growth factor receptor
Synonyms:
2.7.10.1 NTRK1 NTRK1_HUMAN Neurotrophic tyrosine kinase receptor type 1 Synonyms=MTC TRK1-transforming tyrosine kinase protein TRKA GN Tropomyosin alpha-3 chain/High affinity nerve growth factor receptor Tropomyosin-related kinase A (TrkA) Tyrosine kinase receptor (Trk) Tyrosine kinase receptor A (Trk A) Tyrosine kinase receptor A (TrkA) p140-TrkA
Type:
Mol. Mass.:
87498.18
Organism:
Homo sapiens (Human)
Description:
P04629
Residue:
796
  
Inhibitor
Name:
BDBM136670
Synonyms:
US10005783, 87 US10774085, Example 87 US8865698, 87 | US9676783, 87
Type:
Small organic molecule
Emp. Form.:
C23H24F4N6O2
Mol. Mass.:
492.4693
SMILES:
O[C@H]1CCCN(C1)C(=O)Nc1cnn2ccc(nc12)N1CCC[C@@H]1c1cc(F)ccc1C(F)(F)F
: