Target
Fatty acid synthase
Ligand
BDBM137319
Substrate
Meas. Tech.
Biochemical Assay
IC50
10±n/a nM
Citation
 Oslob, JDMcDowell, RSJohnson, RYang, HEvanchik, MZaharia, CACai, HHu, LW Heterocyclic modulators of lipid synthesis US Patent  US8871790 Publication Date 10/28/2014 
Target
Name:
Fatty acid synthase
Synonyms:
FAS FAS_HUMAN HU FASN
Type:
Enzyme
Mol. Mass.:
273419.37
Organism:
Homo sapiens (Human)
Description:
P49327
Residue:
2511
  
Inhibitor
Name:
BDBM137319
Synonyms:
US8871790, 405
Type:
Small organic molecule
Emp. Form.:
C30H31FN4O2
Mol. Mass.:
498.5911
SMILES:
Cc1cc(C2CCC2)c(cc1C(=O)N1CCC(F)(CC1)c1ccc(cc1)C#N)-c1nc2CCOCc2[nH]1
: