Target
[Pyruvate dehydrogenase (acetyl-transferring)] kinase isozyme 2, mitochondrial
Ligand
BDBM137955
Substrate
Meas. Tech.
Inhibition Assay
pH
8±n/a
Temperature
303.15±n/a K
IC50
16±n/a nM
Comments
extracted
Citation
 Motomura, TNagamori, HSuzawa, KIto, HMorita, TKobayashi, SShinkai, H Fluorene compound and pharmaceutical use thereof US Patent  US8871934 Publication Date 10/28/2014 
Target
Name:
[Pyruvate dehydrogenase (acetyl-transferring)] kinase isozyme 2, mitochondrial
Synonyms:
PDHK2 PDK2_HUMAN Pyruvate dehydrogenase kinase isoenzyme 1 (PDK2)
Type:
Enzyme
Mol. Mass.:
46153.78
Organism:
Homo sapiens (Human)
Description:
Q15119
Residue:
407
  
Inhibitor
Name:
BDBM137955
Synonyms:
US8871934, 548
Type:
Small organic molecule
Emp. Form.:
C23H20F4N2O2
Mol. Mass.:
432.4107
SMILES:
OCC1(CCCC1)n1cc(cn1)-c1cc(F)cc2c1-c1ccccc1C2(O)C(F)(F)F
: