Target
Tyrosine-protein kinase JAK1
Ligand
BDBM246886
Substrate
Meas. Tech.
Biochemical JAK Kinase Assay
IC50
<10±n/a nM
Citation
 Li, YCombs, AP Bicyclic heteroarylaminoalkyl phenyl derivatives as PI3K inhibitors US Patent  US10077277 Publication Date 9/18/2018 
Target
Name:
Tyrosine-protein kinase JAK1
Synonyms:
JAK-1 JAK1A JAK1_HUMAN Janus kinase 1 (JAK1) | Janus kinase 1 JAK1
Type:
Protein
Mol. Mass.:
133293.73
Organism:
Homo sapiens (Human)
Description:
P23458
Residue:
1154
  
Inhibitor
Name:
BDBM246886
Synonyms:
US10053465, 25 US10125150, Example 25 US10479803, Example 25 US10675284, Example 25 US11130767, # 25 US11304949, Compound 25 US11406640, Comp. No. 25 US9732097, Example 25 | {trans-5-3-(4-{[4- ({[(2S)-2- hydroxypropyl] amino}methyl)-6- (trifluoromethyl) pyridin-2- yl]oxy}piperidin-1- yl)-1-[4-(7H- pyrrolo[2,3- d]pyrimidin-4-yl)- 1H-pyrazol-1- yl]cyclobutyl} acetonitrile
Type:
Small organic molecule
Emp. Form.:
C30H34F3N9O2
Mol. Mass.:
609.6453
SMILES:
C[C@H](O)CNCc1cc(OC2CCN(CC2)[C@H]2C[C@@](CC#N)(C2)n2cc(cn2)-c2ncnc3[nH]ccc23)nc(c1)C(F)(F)F
: