Target
Dipeptidyl peptidase 1
Ligand
BDBM138124
Substrate
Meas. Tech.
Inhibition Assay
pH
6±n/a
Temperature
298.15±n/a K
Ki
35.8±n/a nM
Comments
extracted
Citation
 Anderskewitz, RGrundl, MMorschhaeuser, GOost, TPautsch, A Substituted 2-aza-bicyclo[2.2.1]heptane-3-carboxylic acid (cyano-methyl)-amides inhibitors of cathepsin C US Patent  US8871783 Publication Date 10/28/2014 
Target
Name:
Dipeptidyl peptidase 1
Synonyms:
CATC_HUMAN CTSC Cathepsin J Dipeptidyl peptidase 1 (DPPI) Dipeptidyl peptidase I (DPPI)
Type:
Enzyme
Mol. Mass.:
51857.28
Organism:
Homo sapiens (Human)
Description:
P53634
Residue:
463
  
Inhibitor
Name:
BDBM138124
Synonyms:
US8871783, 10
Type:
Small organic molecule
Emp. Form.:
C18H18BrN3OS
Mol. Mass.:
404.324
SMILES:
Brc1ccc2sc(CC(NC(=O)[C@H]3N[C@@H]4CC[C@H]3C4)C#N)cc2c1
: