Target
Dipeptidyl peptidase 1
Ligand
BDBM138136
Substrate
Meas. Tech.
Inhibition Assay
pH
6±n/a
Temperature
298.15±n/a K
Ki
2.2±n/a nM
Comments
extracted
Citation
 Anderskewitz, RGrundl, MMorschhaeuser, GOost, TPautsch, A Substituted 2-aza-bicyclo[2.2.1]heptane-3-carboxylic acid (cyano-methyl)-amides inhibitors of cathepsin C US Patent  US8871783 Publication Date 10/28/2014 
Target
Name:
Dipeptidyl peptidase 1
Synonyms:
CATC_HUMAN CTSC Cathepsin J Dipeptidyl peptidase 1 (DPPI) Dipeptidyl peptidase I (DPPI)
Type:
Enzyme
Mol. Mass.:
51857.28
Organism:
Homo sapiens (Human)
Description:
P53634
Residue:
463
  
Inhibitor
Name:
BDBM138136
Synonyms:
US8871783, 22
Type:
Small organic molecule
Emp. Form.:
C23H23FN4O2S
Mol. Mass.:
438.518
SMILES:
CN1C(=O)Cc2ccc(cc12)-c1cc(F)c(CC(NC(=O)[C@H]2N[C@@H]3CC[C@H]2C3)C#N)s1
: