Target
Poly [ADP-ribose] polymerase 1
Ligand
BDBM138299
Substrate
Meas. Tech.
Biochemical Assay
IC50
390±n/a nM
Citation
 Papeo, GMAnatolievna Busel, AKhvat, AKrasavin, MYForte, BZuccotto, F 3-oxo-2,3-dihydro-1H-isoindole-4-carboxamides as PARP inhibitors US Patent  US8877944 Publication Date 11/4/2014 
Target
Name:
Poly [ADP-ribose] polymerase 1
Synonyms:
Adprp Adprt1 Parp1 Poly [ADP-ribose] polymerase-1
Type:
PROTEIN
Mol. Mass.:
113131.74
Organism:
Mus musculus
Description:
ChEMBL_159828
Residue:
1013
  
Inhibitor
Name:
BDBM138299
Synonyms:
US8877944, 1
Type:
Small organic molecule
Emp. Form.:
C21H29N3O3
Mol. Mass.:
371.4733
SMILES:
CO[C@H]1CC[C@H](CC1)N1CCC(CC1)N1Cc2cccc(C(N)=O)c2C1=O
: