Target
Poly [ADP-ribose] polymerase 1
Ligand
BDBM138334
Substrate
Meas. Tech.
Biochemical Assay
IC50
260±n/a nM
Citation
 Papeo, GMAnatolievna Busel, AKhvat, AKrasavin, MYForte, BZuccotto, F 3-oxo-2,3-dihydro-1H-isoindole-4-carboxamides as PARP inhibitors US Patent  US8877944 Publication Date 11/4/2014 
Target
Name:
Poly [ADP-ribose] polymerase 1
Synonyms:
Adprp Adprt1 Parp1 Poly [ADP-ribose] polymerase-1
Type:
PROTEIN
Mol. Mass.:
113131.74
Organism:
Mus musculus
Description:
ChEMBL_159828
Residue:
1013
  
Inhibitor
Name:
BDBM138334
Synonyms:
US8877944, 38
Type:
Small organic molecule
Emp. Form.:
C24H29N3O2
Mol. Mass.:
391.506
SMILES:
CC(C)c1ccc(CN2CCC(CC2)N2Cc3cccc(C(N)=O)c3C2=O)cc1
: