Target
Pyruvate kinase PKM
Ligand
BDBM138385
Substrate
Meas. Tech.
Inhibition Assay
IC50
90000±n/a nM
Citation
 Cantley, LVander Heiden, MGChristofk, HR Inhibitors of pyruvate kinase and methods of treating disease US Patent  US8877791 Publication Date 11/4/2014 
Target
Name:
Pyruvate kinase PKM
Synonyms:
KPYM_HUMAN PK2 PKM Pyruvate kinase (PKM2)
Type:
Protein
Mol. Mass.:
57944.31
Organism:
Homo sapiens (Human)
Description:
P14618
Residue:
531
  
Inhibitor
Name:
BDBM138385
Synonyms:
US8877791, A1
Type:
Small organic molecule
Emp. Form.:
C15H17NOS
Mol. Mass.:
259.367
SMILES:
CC(=O)CSc1ccc(cc1)-n1c(C)ccc1C
: