Target
Neprilysin
Ligand
BDBM138396
Substrate
Meas. Tech.
In Vitro Inhibition Assay
pH
7.4±n/a
Temperature
298.15±n/a K
IC50
0.2±n/a nM
Comments
extracted
Citation
 Iwaki, YKawanami, TKsander, GMMoji, M Substituted carbamoylmethylamino acetic acid derivatives as novel NEP inhibitors US Patent  US8877786 Publication Date 11/4/2014 
Target
Name:
Neprilysin
Synonyms:
Atriopeptidase CD_antigen=CD10 EPN MME NEP_HUMAN Neutral endopeptidase | Neutral endopeptidase 24.11
Type:
Enzyme
Mol. Mass.:
85505.38
Organism:
Homo sapiens (Human)
Description:
P08473
Residue:
750
  
Inhibitor
Name:
BDBM138396
Synonyms:
US8877786, Example 3-13
Type:
Small organic molecule
Emp. Form.:
C20H23ClN6O3
Mol. Mass.:
430.888
SMILES:
CC[C@H](N[C@@H](Cc1ccc(cc1)-c1cccc(Cl)c1)C(=O)NC1=NNNN1)C(O)=O
: