Target
Peptidyl-prolyl cis-trans isomerase A
Ligand
BDBM285695
Substrate
Meas. Tech.
Protease-Free PPIase Assay
pH
7.8±n/a
Ki
5.10±n/a nM
Comments
extracted
Citation
 Pettit, SNJones, ADFrydrych, CSThomas, AJGarst, ME Cyclosporins modified on the MeBmt sidechain by heterocyclic rings US Patent  US10077289 Publication Date 9/18/2018 
Target
Name:
Peptidyl-prolyl cis-trans isomerase A
Synonyms:
CYPA Cyclophilin A PPIA PPIase A Rotamase A
Type:
Protein
Mol. Mass.:
18015.32
Organism:
Homo sapiens (Human)
Description:
P62937
Residue:
165
  
Inhibitor
Name:
BDBM285695
Synonyms:
US10077289, Compound 4 | [(2S,3R,4R)-5-(1-(N,N-Dimethyl-ethyl)-1H-imidazol-2-yl)-3-hydroxy-4-methyl-2-(methylamino) pentanoic acid]1 [(R)-methyl-Sar]3 cyclosporin A
Type:
Small organic molecule
Emp. Form.:
C67H120N14O12
Mol. Mass.:
1313.7563
SMILES:
CC[C@H]1NC(=O)[C@@H]([C@H](O)[C@H](C)Cc2nccn2CCN(C)C)N(C)C(=O)[C@@H](C(C)C)N(C)C(=O)[C@@H](CC(C)C)N(C)C(=O)[C@@H](CC(C)C)N(C)C(=O)[C@H](C)NC(=O)[C@@H](C)NC(=O)[C@@H](CC(C)C)N(C)C(=O)[C@H](NC(=O)[C@H](CC(C)C)N(C)C(=O)[C@@H](C)N(C)C1=O)C(C)C
: