Target
Peptidyl-prolyl cis-trans isomerase A
Ligand
BDBM285728
Substrate
Meas. Tech.
Protease-Free PPIase Assay
pH
7.8±n/a
Ki
7.70±n/a nM
Comments
extracted
Citation
 Pettit, SNJones, ADFrydrych, CSThomas, AJGarst, ME Cyclosporins modified on the MeBmt sidechain by heterocyclic rings US Patent  US10077289 Publication Date 9/18/2018 
Target
Name:
Peptidyl-prolyl cis-trans isomerase A
Synonyms:
CYPA Cyclophilin A PPIA PPIase A Rotamase A
Type:
Protein
Mol. Mass.:
18015.32
Organism:
Homo sapiens (Human)
Description:
P62937
Residue:
165
  
Inhibitor
Name:
BDBM285728
Synonyms:
US10077289, Compound 36 | [(2S,3R,4R)-3-Hydroxy-4-methyl-2-(methylamino)-6-(pyrimidin-2-yloxy)-hexanoic acid]1 cyclosporin A
Type:
Small organic molecule
Emp. Form.:
C65H113N13O13
Mol. Mass.:
1284.672
SMILES:
CC[C@H]1NC(=O)[C@@H]([C@H](O)[C@H](C)CCOc2ncccn2)N(C)C(=O)[C@@H](C(C)C)N(C)C(=O)[C@@H](CC(C)C)N(C)C(=O)[C@@H](CC(C)C)N(C)C(=O)[C@H](C)NC(=O)[C@@H](C)NC(=O)[C@@H](CC(C)C)N(C)C(=O)[C@H](NC(=O)[C@H](CC(C)C)N(C)C(=O)[C@@H](C)N(C)C1=O)C(C)C
: