Target
Bcl-2-like protein 1
Ligand
BDBM139046
Substrate
Meas. Tech.
Time Resolved-Fluorescence Resonance Energy Transfer (TR-FRET) Assay
Temperature
298.15±n/a K
Ki
1.7±n/a nM
Comments
extracted
Citation
 Judd, ASSouers, AJTao, Z Apoptosis-inducing agents for the treatment of cancer and immune and autoimmune diseases US Patent  US8883784 Publication Date 11/11/2014 
Target
Name:
Bcl-2-like protein 1
Synonyms:
Anti-apoptotic Bcl-2 protein Apoptosis regulator Bcl-X BCL2-like 1 isoform 1 BCL2L1 Bcl-2-like protein 1 (Bcl-XL) Bcl-xL/Bcl-2-binding component 3 Bcl2-antagonist of cell death (BAD)
Type:
Mitochondrion membrane; Single-pass membrane protein
Mol. Mass.:
26039.60
Organism:
Homo sapiens (Human)
Description:
Residue:
233
  
Inhibitor
Name:
BDBM139046
Synonyms:
US8883784, 7
Type:
Small organic molecule
Emp. Form.:
C33H32F3N7O6S4
Mol. Mass.:
807.906
SMILES:
CN(C)CCCNc1ccc(cc1S(=O)(=O)C(F)(F)F)S(=O)(=O)NC(=O)c1csc(n1)N1CCc2cccc(C(=O)Nc3nc4ccccc4s3)c2C1
: