Target
Baculoviral IAP repeat-containing protein 2
Ligand
BDBM139071
Substrate
Meas. Tech.
Fluorescence Polarization (FP) Based Competitive Assay
pH
7.5±n/a
IC50
<300±n/a nM
Comments
extracted
Citation
 Wang, SSheng, RSun, HLiu, LLu, JMcEachern, D Bivalent inhibitors of IAP proteins and therapeutic methods using the same US Patent  US8883771 Publication Date 11/11/2014 
Target
Name:
Baculoviral IAP repeat-containing protein 2
Synonyms:
API1 BIRC2_HUMAN Cellular inhibitor of apoptosis 1 MIHB | RNF48
Type:
Protein
Mol. Mass.:
69900.47
Organism:
Homo sapiens (Human)
Description:
Q13490
Residue:
618
  
Inhibitor
Name:
BDBM139071
Synonyms:
US8883771, 17
Type:
Small organic molecule
Emp. Form.:
C62H74N12O6S2
Mol. Mass.:
1147.458
SMILES:
CN[C@@H](C)C(=O)N[C@H]1CN(CC[C@H]2CCC(N2C1=O)C(=O)NC(c1ccccc1)c1ccccc1)C(=S)Nc1ccc(NC(=S)N2CC[C@H]3CC[C@H](N3C(=O)[C@H](C2)NC(=O)[C@H](C)NC)C(=O)NC(c2ccccc2)c2ccccc2)cc1
: