Target
Baculoviral IAP repeat-containing protein 2
Ligand
BDBM139104
Substrate
Meas. Tech.
Fluorescence Polarization (FP) Based Competitive Assay
pH
7.5±n/a
IC50
<1000±n/a nM
Comments
extracted
Citation
 Wang, SSheng, RSun, HLiu, LLu, JMcEachern, D Bivalent inhibitors of IAP proteins and therapeutic methods using the same US Patent  US8883771 Publication Date 11/11/2014 
Target
Name:
Baculoviral IAP repeat-containing protein 2
Synonyms:
API1 BIRC2_HUMAN Cellular inhibitor of apoptosis 1 MIHB | RNF48
Type:
Protein
Mol. Mass.:
69900.47
Organism:
Homo sapiens (Human)
Description:
Q13490
Residue:
618
  
Inhibitor
Name:
BDBM139104
Synonyms:
US8883771, 50
Type:
Small organic molecule
Emp. Form.:
C56H82N12O8
Mol. Mass.:
1051.3259
SMILES:
CN[C@@H](C)C(=O)N[C@H]1CN(CC[C@H]2CCC(N2C1=O)C(=O)N[C@H]1C[C@H](C1)c1ccccc1)C(=O)NCCCCCCNC(=O)N1CC[C@H]2CC[C@H](N2C(=O)[C@H](C1)NC(=O)[C@H](C)NC)C(=O)N[C@H]1C[C@H](C1)c1ccccc1
: