Target
Deoxyuridine 5'-triphosphate nucleotidohydrolase, mitochondrial
Ligand
BDBM101909
Substrate
Meas. Tech.
Inhibition Assay
pH
7.4±n/a
Temperature
310.15±n/a K
IC50
330±n/a nM
Comments
extracted
Citation
 Fukuoka, MYokogawa, TMiyahara, SMiyakoshi, HYano, WTaguchi, JTakao, Y Anti-tumor effect potentiator US Patent  US8883759 Publication Date 11/11/2014 
Target
Name:
Deoxyuridine 5'-triphosphate nucleotidohydrolase, mitochondrial
Synonyms:
DUT Deoxyuridine 5'-triphosphate nucleotidohydrolase (dUTPase) dUTP pyrophosphatase
Type:
Enzyme
Mol. Mass.:
26574.03
Organism:
Homo sapiens (Human)
Description:
P33316
Residue:
252
  
Inhibitor
Name:
BDBM101909
Synonyms:
US8530490, 1
Type:
Small orangic molecule
Emp. Form.:
C19H25N3O6S
Mol. Mass.:
423.483
SMILES:
O=c1ccn(COCCCS(=O)(=O)NCc2cccc(OCC3CC3)c2)c(=O)[nH]1
: