Target
Deoxyuridine 5'-triphosphate nucleotidohydrolase, mitochondrial
Ligand
BDBM101793
Substrate
Meas. Tech.
Inhibition Assay
pH
7.4±n/a
Temperature
310.15±n/a K
IC50
230±n/a nM
Comments
extracted
Citation
 Fukuoka, MYokogawa, TMiyahara, SMiyakoshi, HYano, WTaguchi, JTakao, Y Anti-tumor effect potentiator US Patent  US8883759 Publication Date 11/11/2014 
Target
Name:
Deoxyuridine 5'-triphosphate nucleotidohydrolase, mitochondrial
Synonyms:
DUT Deoxyuridine 5'-triphosphate nucleotidohydrolase (dUTPase) dUTP pyrophosphatase
Type:
Enzyme
Mol. Mass.:
26574.03
Organism:
Homo sapiens (Human)
Description:
P33316
Residue:
252
  
Inhibitor
Name:
BDBM101793
Synonyms:
US8530490, 53
Type:
Small organic molecule
Emp. Form.:
C18H22F3N3O6S
Mol. Mass.:
465.444
SMILES:
C[C@@H](NS(=O)(=O)CCCOCn1ccc(=O)[nH]c1=O)c1cccc(OCC(F)(F)F)c1
: