Target
Vascular endothelial growth factor receptor 2
Ligand
BDBM4851
Substrate
polyGluTyr
Meas. Tech.
Kinase Inhibition Assay
IC50
37±n/a nM
Citation
 Bold, GAltmann, KHFrei, JLang, MManley, PWTraxler, PWietfeld, BBruggen, JBuchdunger, ECozens, RFerrari, SFuret, PHofmann, FMartiny-Baron, GMestan, JRosel, JSills, MStover, DAcemoglu, FBoss, EEmmenegger, RLasser, LMasso, ERoth, RSchlachter, CVetterli, W New anilinophthalazines as potent and orally well absorbed inhibitors of the VEGF receptor tyrosine kinases useful as antagonists of tumor-driven angiogenesis. J Med Chem 43:2310-23 (2000)  
Target
Name:
Vascular endothelial growth factor receptor 2
Synonyms:
CD_antigen=CD309 Fetal liver kinase 1 (FLK-1) KDR Protein-tyrosine kinase receptor Flk-1 VEGFR-2 VEGFR2 Vascular Endothelial Growth Factor Receptor Kinase 2 Vascular endothelial growth factor receptor 2 (KDR) Vascular endothelial growth factor receptor 2 (VEGFR2) Vascular endothelial growth factor receptor-2 (VEGFR-2)
Type:
Receptor Tyrosine Kinase
Mol. Mass.:
151510.97
Organism:
Homo sapiens (Human)
Description:
P35968
Residue:
1356
  
Inhibitor
Name:
BDBM4851
Synonyms:
(4-chlorophenyl)-[4-(4-pyridylmethyl)phthalazin-1-yl]amine CGP 79787 CHEMBL75232 N-(4-chlorophenyl)-4-(pyridin-4-ylmethyl)phthalazin-1-amine PTK787 cid_151194
Type:
Small organic molecule
Emp. Form.:
C20H15ClN4
Mol. Mass.:
346.813
SMILES:
Clc1ccc(Nc2nnc(Cc3ccncc3)c3ccccc23)cc1
:
Substrate
Name:
polyGluTyr
Synonyms:
Type:
Peptide
Mol. Mass.:
358.43
Organism:
Description:
polyGluTyr(4:1). 8 uM ATP and 0.2 uCi [gamma-33P]ATP as co-substrate.
Residue:
3
NA