Target
Cytochrome P450 2C9
Ligand
BDBM25817
Substrate
Meas. Tech.
Inhibition Assay
IC50
29000±n/a nM
Citation
 Hoekstra, WJSchotzinger, RJ Metalloenzyme inhibitor compounds US Patent  US8883797 Publication Date 11/11/2014 
Target
Name:
Cytochrome P450 2C9
Synonyms:
(R)-limonene 6-monooxygenase CP2C9_HUMAN CYP2C9 Cytochrome P450 2C9 (CYP2C9 ) P-450MP P450 PB-1 | S-mephenytoin 4-hydroxylase
Type:
Enzyme
Mol. Mass.:
55636.33
Organism:
Homo sapiens (Human)
Description:
P11712
Residue:
490
  
Inhibitor
Name:
BDBM25817
Synonyms:
2-(2,4-difluorophenyl)-1,3-bis(1H-1,2,4-triazol-1-yl)propan-2-ol Diflucan Fluconazole (f) Triflucan US11247981, Example Fluconazole US9144538, Fluconazole US9556143, Fluconazole | cid_3365
Type:
Small organic molecule
Emp. Form.:
C13H12F2N6O
Mol. Mass.:
306.2708
SMILES:
OC(Cn1cncn1)(Cn1cncn1)c1ccc(F)cc1F
: