Target
Nuclear receptor ROR-gamma
Ligand
BDBM285744
Substrate
Meas. Tech.
RORgammat (full-length human) Reporter Assay A
IC50
25.0±n/a nM
Citation
 Goldberg, SSteeneck, CGege, CKinzel, OKleymann, GHoffmann, TFourie, AMXue, X Thiazoles as modulators of RORγt US Patent  US10080744 Publication Date 9/25/2018 
Target
Name:
Nuclear receptor ROR-gamma
Synonyms:
NR1F3 Nuclear receptor ROR-gamma (RORC) RAR-related orphan receptor C (RORc) RORG RZRG Retinoid-related orphan receptor-gamma (RORc)
Type:
Enzyme Catalytic Domain
Mol. Mass.:
58218.40
Organism:
Homo sapiens (Human)
Description:
P51449
Residue:
518
  
Inhibitor
Name:
BDBM285744
Synonyms:
US10080744, Example 3/11
Type:
Small organic molecule
Emp. Form.:
C25H26F6N4O6S2
Mol. Mass.:
656.618
SMILES:
C[C@H](NS(=O)(=O)c1ccc(-c2sc(nc2CC2CCC2)-c2nnc(CC(C)(C)OC=O)o2)c(OC(F)(F)F)c1)C(F)(F)F
: