Target
Nuclear receptor ROR-gamma
Ligand
BDBM285755
Substrate
Meas. Tech.
ThermoFluor Assay
Kd
0.330±n/a nM
Citation
 Goldberg, SSteeneck, CGege, CKinzel, OKleymann, GHoffmann, TFourie, AMXue, X Thiazoles as modulators of RORγt US Patent  US10080744 Publication Date 9/25/2018 
Target
Name:
Nuclear receptor ROR-gamma
Synonyms:
NR1F3 Nuclear receptor ROR-gamma (RORC) RAR-related orphan receptor C (RORc) RORG RZRG Retinoid-related orphan receptor-gamma (RORc)
Type:
Enzyme Catalytic Domain
Mol. Mass.:
58218.40
Organism:
Homo sapiens (Human)
Description:
P51449
Residue:
518
  
Inhibitor
Name:
BDBM285755
Synonyms:
US10080744, Example 3/22
Type:
Small organic molecule
Emp. Form.:
C29H32F3N5O5S2
Mol. Mass.:
651.72
SMILES:
C[C@H](NS(=O)(=O)c1ccc(-c2sc(nc2CC2CCCCC2)-c2nnc(CC(C)(C)C(O)=O)o2)c2ccncc12)C(F)(F)F
: