Target
Nuclear receptor ROR-gamma
Ligand
BDBM285769
Substrate
Meas. Tech.
RORgammat (full-length human) Reporter Assay A
IC50
4.60±n/a nM
Citation
 Goldberg, SSteeneck, CGege, CKinzel, OKleymann, GHoffmann, TFourie, AMXue, X Thiazoles as modulators of RORγt US Patent  US10080744 Publication Date 9/25/2018 
Target
Name:
Nuclear receptor ROR-gamma
Synonyms:
NR1F3 Nuclear receptor ROR-gamma (RORC) RAR-related orphan receptor C (RORc) RORG RZRG Retinoid-related orphan receptor-gamma (RORc)
Type:
Enzyme Catalytic Domain
Mol. Mass.:
58218.40
Organism:
Homo sapiens (Human)
Description:
P51449
Residue:
518
  
Inhibitor
Name:
BDBM285769
Synonyms:
US10080744, Example 3/36
Type:
Small organic molecule
Emp. Form.:
C28H31F6N3O4S
Mol. Mass.:
619.619
SMILES:
CC(C)(C)c1cc(cc(c1)C(O)(C(F)(F)F)C(F)(F)F)-c1sc(nc1CC1CCC1)-c1nnc(CC(C)(C)C(O)=O)o1
: