Target
Nuclear receptor ROR-gamma
Ligand
BDBM285773
Substrate
Meas. Tech.
ThermoFluor Assay
Kd
0.030±n/a nM
Citation
 Goldberg, SSteeneck, CGege, CKinzel, OKleymann, GHoffmann, TFourie, AMXue, X Thiazoles as modulators of RORγt US Patent  US10080744 Publication Date 9/25/2018 
Target
Name:
Nuclear receptor ROR-gamma
Synonyms:
NR1F3 Nuclear receptor ROR-gamma (RORC) RAR-related orphan receptor C (RORc) RORG RZRG Retinoid-related orphan receptor-gamma (RORc)
Type:
Enzyme Catalytic Domain
Mol. Mass.:
58218.40
Organism:
Homo sapiens (Human)
Description:
P51449
Residue:
518
  
Inhibitor
Name:
BDBM285773
Synonyms:
US10080744, Example 3/40
Type:
Small organic molecule
Emp. Form.:
C26H28ClF5N4O5S2
Mol. Mass.:
671.099
SMILES:
C[C@H](NS(=O)(=O)c1ccc(-c2sc(nc2CC2CCCC2)-c2nnc(CC(C)(C)C(O)=O)o2)c(C(F)F)c1Cl)C(F)(F)F
: