Target
Nuclear receptor ROR-gamma
Ligand
BDBM285796
Substrate
Meas. Tech.
ThermoFluor Assay
Kd
0.270±n/a nM
Citation
 Goldberg, SSteeneck, CGege, CKinzel, OKleymann, GHoffmann, TFourie, AMXue, X Thiazoles as modulators of RORγt US Patent  US10080744 Publication Date 9/25/2018 
Target
Name:
Nuclear receptor ROR-gamma
Synonyms:
NR1F3 Nuclear receptor ROR-gamma (RORC) RAR-related orphan receptor C (RORc) RORG RZRG Retinoid-related orphan receptor-gamma (RORc)
Type:
Enzyme Catalytic Domain
Mol. Mass.:
58218.40
Organism:
Homo sapiens (Human)
Description:
P51449
Residue:
518
  
Inhibitor
Name:
BDBM285796
Synonyms:
US10080744, Example 11/7
Type:
Small organic molecule
Emp. Form.:
C26H27F7N4O5S2
Mol. Mass.:
672.635
SMILES:
CC[C@H](NS(=O)(=O)c1ccc(-c2sc(nc2CC2CCC2)-c2noc(CC(C)(C)OC=O)n2)c(c1F)C(F)(F)F)C(F)(F)F
: