Target
Nuclear receptor ROR-gamma
Ligand
BDBM285807
Substrate
Meas. Tech.
ThermoFluor Assay
Kd
1.60±n/a nM
Citation
 Goldberg, SSteeneck, CGege, CKinzel, OKleymann, GHoffmann, TFourie, AMXue, X Thiazoles as modulators of RORγt US Patent  US10080744 Publication Date 9/25/2018 
Target
Name:
Nuclear receptor ROR-gamma
Synonyms:
NR1F3 Nuclear receptor ROR-gamma (RORC) RAR-related orphan receptor C (RORc) RORG RZRG Retinoid-related orphan receptor-gamma (RORc)
Type:
Enzyme Catalytic Domain
Mol. Mass.:
58218.40
Organism:
Homo sapiens (Human)
Description:
P51449
Residue:
518
  
Inhibitor
Name:
BDBM285807
Synonyms:
US10080744, Example 12/6
Type:
Small organic molecule
Emp. Form.:
C28H31F8N5O5S2
Mol. Mass.:
733.693
SMILES:
CC[C@H](NS(=O)(=O)c1ccc(-c2sc(nc2CN2CC(F)(F)CC2(C)C)-c2noc(CC(C)(C)C(O)=O)n2)c(C(F)F)c1F)C(F)(F)F
: