Target
Poly [ADP-ribose] polymerase 1
Ligand
BDBM139630
Substrate
Meas. Tech.
Enzyme Assay
pH
8±n/a
IC50
23±n/a nM
Comments
extracted
Citation
 Xu, WDelahanty, GWei, LZhang, J PARP inhibitor compounds, compositions and methods of use US Patent  US8894989 Publication Date 11/25/2014 
Target
Name:
Poly [ADP-ribose] polymerase 1
Synonyms:
(ARTD1 or PARP1) 2.4.2.30 ADPRT ARTD1 Human diphtheria toxin-like ADP-ribosyltransferase (ARTD1 or PARP1) NT-PARP-1 PARP1 PPOL Poly [ADP-ribose] polymerase 1 (PARP) Poly [ADP-ribose] polymerase 1 (PARP1) Poly [ADP-ribose] polymerase 1, 28-kDa form Poly [ADP-ribose] polymerase 1, processed C-terminus Poly [ADP-ribose] polymerase-1 Poly(ADP-ribose) polymerase-1 (ARTD1/PARP1) Protein poly-ADP-ribosyltransferase PARP1 | Synonyms=ADPRT
Type:
Mol. Mass.:
113114.22
Organism:
Homo sapiens (Human)
Description:
P09874
Residue:
1014
  
Inhibitor
Name:
BDBM139630
Synonyms:
US8894989, 8
Type:
Small organic molecule
Emp. Form.:
C20H20N6O
Mol. Mass.:
360.4124
SMILES:
O=c1[nH]nc2[nH]c(CN3CCN(CC3)c3ccccc3)nc3cccc1c23
: