Target
Histone-lysine N-methyltransferase EZH2
Ligand
BDBM50009672
Substrate
Meas. Tech.
Inhibition Assay
pH
7.6±n/a
IC50
263±n/a nM
Comments
extracted
Citation
 Copeland, RARichon, VMScott, MDSneeringer, CJKuntz, KWKnutson, SKPollock, RM Inhibitors of human EZH2 and methods of use thereof US Patent  US8895245 Publication Date 11/25/2014 
Target
Name:
Histone-lysine N-methyltransferase EZH2
Synonyms:
ENX-1 EZH2_HUMAN Histone-lysine N-methyltransferase EZH2 Lysine N-methyltransferase 6
Type:
Protein
Mol. Mass.:
85367.84
Organism:
Homo sapiens (Human)
Description:
Q15910
Residue:
746
  
Inhibitor
Name:
BDBM50009672
Synonyms:
AdoHcy S-(5'-adenosyl)-L-homocysteine S-[1-(adenin-9-yl)-1,5-dideoxy-beta-D-ribofuranos-5-yl]-L-homocysteine SAH US9175331, 1 | US9333217, S-Adenosyl-L-homocysteine (SAH)
Type:
Small organic molecule
Emp. Form.:
C14H20N6O5S
Mol. Mass.:
384.411
SMILES:
N[C@@H](CCSC[C@H]1O[C@H]([C@H](O)[C@@H]1O)n1cnc2c(N)ncnc12)C(O)=O
: