Target
3-phosphoinositide-dependent protein kinase 1
Ligand
BDBM139800
Substrate
Meas. Tech.
Kinase Assay
pH
7.5±n/a
IC50
2±n/a nM
Comments
extracted
Citation
 McConnell, DEngelhardt, HKofink, C 1H-imidazo[4,5-c]quinolines US Patent  US8895581 Publication Date 11/25/2014 
Target
Name:
3-phosphoinositide-dependent protein kinase 1
Synonyms:
3-Phosphoinositide-Dependent Protein Kinase 1 (PDK1) 3-phosphoinositide-dependent protein kinase 1 3-phosphoinositide-dependent protein kinase 1 (PDK-1) Isoform 2 of 3-phosphoinositide-dependent protein kinase 1 PDPK1 Phosphoinositide-dependent protein kinase 1 (PDK1) hPDK1
Type:
Enzyme
Mol. Mass.:
63157.65
Organism:
Homo sapiens (Human)
Description:
O15530
Residue:
556
  
Inhibitor
Name:
BDBM139800
Synonyms:
US8895581, II-21
Type:
Small organic molecule
Emp. Form.:
C31H29N5O3
Mol. Mass.:
519.5937
SMILES:
CC(C)n1c(C)nc2cnc3ccc(cc3c12)C#CCNC(=O)c1cccn([C@@H](CO)c2ccccc2)c1=O
: