Target
Ribosomal protein S6 kinase beta-1 [T412E]
Ligand
BDBM224351
Substrate
Meas. Tech.
P70S6K Enzyme Assay
pH
7.5±n/a
IC50
260±n/a nM
Comments
extracted
Citation
 Lan, RHuck, BRChen, XDeselm, LCQiu, HXiao, YNeagu, CMochalkin, IJohnson, TL Aminopyrimidine derivatives for use as modulators of kinase activity US Patent  US10080750 Publication Date 9/25/2018 
Target
Name:
Ribosomal protein S6 kinase beta-1 [T412E]
Synonyms:
KS6B1_HUMAN RPS6KB1 p70 ribosomal S6 kinase alpha (P70S6K)(T412E)
Type:
Enzyme Catalytic Domain
Mol. Mass.:
59166.89
Organism:
Homo sapiens (Human)
Description:
P23443[T412E]
Residue:
525
  
Inhibitor
Name:
BDBM224351
Synonyms:
US10080750, Compound 28 US9662330, Compound 28
Type:
Small organic molecule
Emp. Form.:
C22H29F3N6
Mol. Mass.:
434.5011
SMILES:
CN(C)CC(N1CCN(CC1)c1ncnc(N)c1C1CC1)c1ccc(cc1)C(F)(F)F
: