Target
Ribosomal protein S6 kinase beta-1 [T412E]
Ligand
BDBM224511
Substrate
Meas. Tech.
P70S6K Enzyme Assay
pH
7.5±n/a
IC50
140±n/a nM
Comments
extracted
Citation
 Lan, RHuck, BRChen, XDeselm, LCQiu, HXiao, YNeagu, CMochalkin, IJohnson, TL Aminopyrimidine derivatives for use as modulators of kinase activity US Patent  US10080750 Publication Date 9/25/2018 
Target
Name:
Ribosomal protein S6 kinase beta-1 [T412E]
Synonyms:
KS6B1_HUMAN RPS6KB1 p70 ribosomal S6 kinase alpha (P70S6K)(T412E)
Type:
Enzyme Catalytic Domain
Mol. Mass.:
59166.89
Organism:
Homo sapiens (Human)
Description:
P23443[T412E]
Residue:
525
  
Inhibitor
Name:
BDBM224511
Synonyms:
US10080750, Compound 189 US9662330, Compound 189
Type:
Small organic molecule
Emp. Form.:
C22H19F4N7
Mol. Mass.:
457.4268
SMILES:
Nc1ncnc(N2CCN(CC2)C(C#N)c2ccc(nc2)C(F)(F)F)c1-c1ccc(F)cc1
: