Target
Protein O-GlcNAcase
Ligand
BDBM139958
Substrate
Meas. Tech.
Inhibition Assay
pH
7±n/a
Temperature
298.15±n/a K
Ki
0.8±n/a nM
Comments
extracted
Citation
 Chang, JLiu, KMcEachern, EJMu, CSelnick, HGShi, FVocadlo, DJWang, YWei, ZZhou, YZhu, Y Selective glycosidase inhibitors and uses thereof US Patent  US8901087 Publication Date 12/2/2014 
Target
Name:
Protein O-GlcNAcase
Synonyms:
2-acetamido-2-deoxy-β-D-glucopyranosidase (O-GlcNAcase) Beta-hexosaminidase (O-GlcNAcase) HEXC MEA5 N-acetyl-beta-D-glucosaminidase (O-GlcNAcase) OGA Protein O-GlcNAcase
Type:
Enzyme
Mol. Mass.:
102874.67
Organism:
Homo sapiens (Human)
Description:
O60502
Residue:
916
  
Inhibitor
Name:
BDBM139958
Synonyms:
US8901087, 181
Type:
Small organic molecule
Emp. Form.:
C9H15FN2O3S
Mol. Mass.:
250.29
SMILES:
CNC1=N[C@H]2[C@H](O[C@H]([C@@H](C)F)[C@@H](O)[C@@H]2O)S1
: