Target
Peptidyl-prolyl cis-trans isomerase G
Ligand
BDBM46034
Substrate
Meas. Tech.
Enzymatic Assay
pH
7.8±n/a
Temperature
293.15±n/a K
IC50
9000±n/a nM
Comments
extracted
Citation
 Guichou, JColliandre, LAhmed-Belkacem, HPawlotsky, J Inhibitors of cyclophilins and uses thereof US Patent  US8901295 Publication Date 12/2/2014 
Target
Name:
Peptidyl-prolyl cis-trans isomerase G
Synonyms:
Cyclophilin A (CYPA) PPIG_HUMAN
Type:
Enzyme
Mol. Mass.:
88718.95
Organism:
Homo sapiens (Human)
Description:
Q13427
Residue:
754
  
Inhibitor
Name:
BDBM46034
Synonyms:
US8901295, F607
Type:
Emp. Form.:
C19H24N4O3
Mol. Mass.:
356.4189
SMILES:
CCN(OCc1ccccc1)C(=O)CNC(=O)NCc1ccc(N)cc1
: