Target
High affinity cAMP-specific 3',5'-cyclic phosphodiesterase 7A
Ligand
BDBM140149
Substrate
Meas. Tech.
Inhibition Assay
pH
7.5±n/a
Temperature
277.15±n/a K
IC50
67±n/a nM
Comments
extracted
Citation
 Inoue, HMurafuji, HHayashi, Y Thienopyrazole derivative having PDE7 inhibitory activity US Patent  US8901315 Publication Date 12/2/2014 
Target
Name:
High affinity cAMP-specific 3',5'-cyclic phosphodiesterase 7A
Synonyms:
3',5'-cyclic phosphodiesterase PDE7A_HUMAN Phosphodiesterase 7 (PDE7) Phosphodiesterase 7A (PDE7A1)
Type:
Enzyme
Mol. Mass.:
55514.96
Organism:
Homo sapiens (Human)
Description:
Q13946
Residue:
482
  
Inhibitor
Name:
BDBM140149
Synonyms:
US8901315, 317
Type:
Small organic molecule
Emp. Form.:
C19H25N5O3S
Mol. Mass.:
403.499
SMILES:
CN1C(=O)CN(CCNC(=O)c2cc3c(C)nn(C4CCCCC4)c3s2)C1=O
: