Target
High affinity cAMP-specific 3',5'-cyclic phosphodiesterase 7A
Ligand
BDBM140164
Substrate
Meas. Tech.
Inhibition Assay
pH
7.5±n/a
Temperature
277.15±n/a K
IC50
24±n/a nM
Comments
extracted
Citation
 Inoue, HMurafuji, HHayashi, Y Thienopyrazole derivative having PDE7 inhibitory activity US Patent  US8901315 Publication Date 12/2/2014 
Target
Name:
High affinity cAMP-specific 3',5'-cyclic phosphodiesterase 7A
Synonyms:
3',5'-cyclic phosphodiesterase PDE7A_HUMAN Phosphodiesterase 7 (PDE7) Phosphodiesterase 7A (PDE7A1)
Type:
Enzyme
Mol. Mass.:
55514.96
Organism:
Homo sapiens (Human)
Description:
Q13946
Residue:
482
  
Inhibitor
Name:
BDBM140164
Synonyms:
US8901315, 369
Type:
Small organic molecule
Emp. Form.:
C22H32N4O3S
Mol. Mass.:
432.579
SMILES:
Cc1nn(C2CCOCC2)c2sc(cc12)C(=O)N[C@H]1CC[C@@H](CC1)N1CCOCC1
: