Target
Phosphodiesterase
Ligand
BDBM140081
Substrate
Meas. Tech.
Inhibition Assay
pH
6.5±n/a
Temperature
277.15±n/a K
IC50
1500±n/a nM
Comments
extracted
Citation
 Inoue, HMurafuji, HHayashi, Y Thienopyrazole derivative having PDE7 inhibitory activity US Patent  US8901315 Publication Date 12/2/2014 
Target
Name:
Phosphodiesterase
Synonyms:
Phosphodiesterase 4 (PDE4)
Type:
Protein
Mol. Mass.:
82059.36
Organism:
Mus musculus (Mouse)
Description:
Q8VBU5
Residue:
721
  
Inhibitor
Name:
BDBM140081
Synonyms:
US8901315, 155
Type:
Small organic molecule
Emp. Form.:
C24H30FN5OS
Mol. Mass.:
455.591
SMILES:
CN1CCN(CC1)c1ccc(NC(=O)c2cc3c(C)nn(C4CCCCC4)c3s2)cc1F
: