Target
Phosphodiesterase
Ligand
BDBM140095
Substrate
Meas. Tech.
Inhibition Assay
pH
6.5±n/a
Temperature
277.15±n/a K
IC50
750±n/a nM
Comments
extracted
Citation
 Inoue, HMurafuji, HHayashi, Y Thienopyrazole derivative having PDE7 inhibitory activity US Patent  US8901315 Publication Date 12/2/2014 
Target
Name:
Phosphodiesterase
Synonyms:
Phosphodiesterase 4 (PDE4)
Type:
Protein
Mol. Mass.:
82059.36
Organism:
Mus musculus (Mouse)
Description:
Q8VBU5
Residue:
721
  
Inhibitor
Name:
BDBM140095
Synonyms:
US8901315, 179
Type:
Small organic molecule
Emp. Form.:
C25H39N5OS
Mol. Mass.:
457.675
SMILES:
CNC1CCN(CC1)[C@H]1CC[C@@H](CC1)NC(=O)c1cc2c(C)nn(C3CCCCC3)c2s1
: