Target
Phosphodiesterase
Ligand
BDBM140132
Substrate
Meas. Tech.
Inhibition Assay
pH
6.5±n/a
Temperature
277.15±n/a K
IC50
1900±n/a nM
Comments
extracted
Citation
 Inoue, HMurafuji, HHayashi, Y Thienopyrazole derivative having PDE7 inhibitory activity US Patent  US8901315 Publication Date 12/2/2014 
Target
Name:
Phosphodiesterase
Synonyms:
Phosphodiesterase 4 (PDE4)
Type:
Protein
Mol. Mass.:
82059.36
Organism:
Mus musculus (Mouse)
Description:
Q8VBU5
Residue:
721
  
Inhibitor
Name:
BDBM140132
Synonyms:
US8901315, 261
Type:
Small organic molecule
Emp. Form.:
C20H22N6O3S
Mol. Mass.:
426.492
SMILES:
Cc1nn(C2CCOCC2)c2sc(cc12)C(=O)Nc1ccc(nc1)N1CCNC1=O
: