Target
C-C chemokine receptor type 2
Ligand
BDBM140210
Substrate
Meas. Tech.
Radioligand Binding Assay
pH
7.4±n/a
Temperature
277.15±n/a K
Ki
306±n/a nM
IC50
233±n/a nM
Comments
extracted
Citation
 Meyer, MDWang, XGuo, TWei, RGWang, LJ Chemokine receptor antagonists US Patent  US8906911 Publication Date 12/9/2014 
Target
Name:
C-C chemokine receptor type 2
Synonyms:
C-C chemokine receptor type 2 (CCR2) CCR2_HUMAN Chemoattractant Cytokine Receptor 2 (CCR2) Monocyte chemotactic protein-1 (MCP-1)
Type:
Enzyme
Mol. Mass.:
41932.32
Organism:
Homo sapiens (Human)
Description:
P41597
Residue:
374
  
Inhibitor
Name:
BDBM140210
Synonyms:
US8906911, 19
Type:
Small organic molecule
Emp. Form.:
C28H38F3N3O3
Mol. Mass.:
521.6148
SMILES:
CO[C@@H]1COCC[C@@H]1N[C@@H]1C[C@H]2CCC[C@]2(C1)C(=O)N1C[C@@H]2C[C@H]1CN2c1ccc(C)c(c1)C(F)(F)F
: