Target
Alcohol dehydrogenase class-3
Ligand
BDBM47039
Substrate
Meas. Tech.
Binding Assay
pH
7.4±n/a
Temperature
295.15±n/a K
IC50
27±n/a nM
Comments
extracted
Citation
 Sun, XQiu, J Dihydropyrimidin-2(1H)-one compounds as neurokinin-3 receptor antagonists US Patent  US8906933 Publication Date 12/9/2014 
Target
Name:
Alcohol dehydrogenase class-3
Synonyms:
1.1.1.- 1.1.1.284 ADHX Alcohol dehydrogenase 5 Alcohol dehydrogenase class-3 FALDH Glutathione-dependent formaldehyde dehydrogenase (GSH-FDH) alcohol dehydrogenase 3 (ADH-3)
Type:
Mol. Mass.:
39728.34
Organism:
Homo sapiens (Human)
Description:
P11766
Residue:
374
  
Inhibitor
Name:
BDBM47039
Synonyms:
US8906933, (R)-3-ethoxy-2-hydroxy-5-(6-(1-methyl-1H-pyrazol-4-yl)-2-oxo-5-(thiophen-3-yl)-1,2,3,4-tetrahydropyrimidin-4-yl)benzoic acid US8906933, 3-ethoxy-2-hydroxy-5-(6-(1-methyl-1H-pyrazol-4-yl)-2-oxo-5-(thiophen-3-yl)-1,2,3,4-tetrahydropyrimidin-4-yl)benzoic acid
Type:
Emp. Form.:
C21H22N4O5S
Mol. Mass.:
442.488
SMILES:
CCOc1cc(cc(C(O)=O)c1O)C1NC(=O)NC(C1c1ccsc1)c1cnn(C)c1
: