Target
Lysosomal acid glucosylceramidase
Ligand
BDBM285817
Substrate
Meas. Tech.
Assay for Determination of Ki Values for Inhibition of GCase Activity
pH
7±n/a
Ki
1400±n/a nM
Comments
extracted
Citation
 Kaul, RMcEachern, EJSun, JVocadlo, DJZhou, YZhu, Y Glucocerebrosidase modulators and uses thereof US Patent  US10081601 Publication Date 9/25/2018 
Target
Name:
Lysosomal acid glucosylceramidase
Synonyms:
Acid beta-glucosidase Beta-glucocerebrosidase D-glucosyl-N-acylsphingosine glucohydrolase GBA1 GC GLUC Glucosylceramidase (GBA) Glucosylceramidase precursor (Beta-glucocerebrosidase) (Acid beta-glucosidase) (D-glucosyl-N-acylsphingosine glucohydrolase) (Alglucerase) (Imiglucerase) beta-glucocerebrosidase (GCase)
Type:
Enzyme
Mol. Mass.:
59724.64
Organism:
Homo sapiens (Human)
Description:
The beta-Glu activity was measured with commercially available beta-glucocerebrosidase (Ceredase) as the enzyme source.
Residue:
536
  
Inhibitor
Name:
BDBM285817
Synonyms:
US10081601, Example 1.2 | US9796680, Example Table2.2
Type:
Small organic molecule
Emp. Form.:
C12H25NO3
Mol. Mass.:
231.3318
SMILES:
CCCC1(CCC)NC[C@@H](O)[C@H](O)[C@H]1CO
: