Target
Lysosomal acid glucosylceramidase
Ligand
BDBM285831
Substrate
Meas. Tech.
Assay for Determination of Ki Values for Inhibition of GCase Activity
pH
7±n/a
IC50
15.0±n/a nM
Comments
extracted
Citation
 Kaul, RMcEachern, EJSun, JVocadlo, DJZhou, YZhu, Y Glucocerebrosidase modulators and uses thereof US Patent  US10081601 Publication Date 9/25/2018 
Target
Name:
Lysosomal acid glucosylceramidase
Synonyms:
Acid beta-glucosidase Beta-glucocerebrosidase D-glucosyl-N-acylsphingosine glucohydrolase GBA1 GC GLUC Glucosylceramidase (GBA) Glucosylceramidase precursor (Beta-glucocerebrosidase) (Acid beta-glucosidase) (D-glucosyl-N-acylsphingosine glucohydrolase) (Alglucerase) (Imiglucerase) beta-glucocerebrosidase (GCase)
Type:
Enzyme
Mol. Mass.:
59724.64
Organism:
Homo sapiens (Human)
Description:
The beta-Glu activity was measured with commercially available beta-glucocerebrosidase (Ceredase) as the enzyme source.
Residue:
536
  
Inhibitor
Name:
BDBM285831
Synonyms:
(6R,7R,8S)-8-propyl-4-azaspiro[2.5]octane-6,7-diol US9796680, Example 13
Type:
Small organic molecule
Emp. Form.:
C10H19NO2
Mol. Mass.:
185.2634
SMILES:
CCC[C@@H]1[C@@H](O)[C@H](O)CNC11CC1
: