Target
Lysosomal acid glucosylceramidase
Ligand
BDBM285838
Substrate
Meas. Tech.
Assay for Determination of Ki Values for Inhibition of GCase Activity
pH
7±n/a
IC50
13.0±n/a nM
Comments
extracted
Citation
 Kaul, RMcEachern, EJSun, JVocadlo, DJZhou, YZhu, Y Glucocerebrosidase modulators and uses thereof US Patent  US10081601 Publication Date 9/25/2018 
Target
Name:
Lysosomal acid glucosylceramidase
Synonyms:
Acid beta-glucosidase Beta-glucocerebrosidase D-glucosyl-N-acylsphingosine glucohydrolase GBA1 GC GLUC Glucosylceramidase (GBA) Glucosylceramidase precursor (Beta-glucocerebrosidase) (Acid beta-glucosidase) (D-glucosyl-N-acylsphingosine glucohydrolase) (Alglucerase) (Imiglucerase) beta-glucocerebrosidase (GCase)
Type:
Enzyme
Mol. Mass.:
59724.64
Organism:
Homo sapiens (Human)
Description:
The beta-Glu activity was measured with commercially available beta-glucocerebrosidase (Ceredase) as the enzyme source.
Residue:
536
  
Inhibitor
Name:
BDBM285838
Synonyms:
(6R,7R,8S)-8-ethynyl-4-azaspiro[2.5]octane-6,7-diol US9796680, Example 20
Type:
Small organic molecule
Emp. Form.:
C9H13NO2
Mol. Mass.:
167.205
SMILES:
O[C@@H]1CNC2(CC2)[C@H](C#C)[C@H]1O
: