Target
Tyrosine-protein kinase SYK
Ligand
BDBM140331
Substrate
Meas. Tech.
Kinase Assay
pH
7.5±n/a
Temperature
193.15±n/a K
IC50
22.3±n/a nM
Citation
 Hoffmann, MBischoff, DDahmann, GKlicic, JSchaenzle, GWollin, SLConvers-Reignier, SGEast, SPMarlin, FJMcCarthy, CScott, J Substituted quinolines and their use as medicaments US Patent  US8912173 Publication Date 12/16/2014 
Target
Name:
Tyrosine-protein kinase SYK
Synonyms:
KSYK_HUMAN Spleen Tyrosine Kinase Tyrosine-protein kinase SYK (Syk)
Type:
Enzyme
Mol. Mass.:
72079.99
Organism:
Homo sapiens (Human)
Description:
P43405
Residue:
635
  
Inhibitor
Name:
BDBM140331
Synonyms:
US8912173, 57
Type:
Small organic molecule
Emp. Form.:
C22H18N4O3
Mol. Mass.:
386.4033
SMILES:
COc1ccc(cn1)-c1cc(OCc2ncccc2C(N)=O)c2cccnc2c1
: