Target
B1 bradykinin receptor
Ligand
BDBM140541
Substrate
Meas. Tech.
Binding Assay
pH
7.4±n/a
Ki
1.4±n/a nM
Comments
extracted
Citation
 Aebi, JBinggeli, AHertel, CKonkar, AAKuehne, HKuhn, BMaerki, HPWang, H Biaryl amide derivatives US Patent  US8912221 Publication Date 12/16/2014 
Target
Name:
B1 bradykinin receptor
Synonyms:
B1 BRADYKININ B1R BK-1 receptor BRADYB1 | Bradykinin B1 receptor
Type:
Enzyme
Mol. Mass.:
40508.87
Organism:
Homo sapiens (Human)
Description:
P46663
Residue:
353
  
Inhibitor
Name:
BDBM140541
Synonyms:
US8912221, 14
Type:
Small organic molecule
Emp. Form.:
C25H21ClF2N6O6
Mol. Mass.:
574.921
SMILES:
COc1cc(on1)C(=O)NC1(COC1)C(=O)N[C@H](C)c1ncc(cc1F)-c1cc(Cl)cc(F)c1-c1noc(C)n1
: