Target
B1 bradykinin receptor
Ligand
BDBM140547
Substrate
Meas. Tech.
Binding Assay
pH
7.4±n/a
Ki
1.6±n/a nM
Comments
extracted
Citation
 Aebi, JBinggeli, AHertel, CKonkar, AAKuehne, HKuhn, BMaerki, HPWang, H Biaryl amide derivatives US Patent  US8912221 Publication Date 12/16/2014 
Target
Name:
B1 bradykinin receptor
Synonyms:
B1 BRADYKININ B1R BK-1 receptor BRADYB1 | Bradykinin B1 receptor
Type:
Enzyme
Mol. Mass.:
40508.87
Organism:
Homo sapiens (Human)
Description:
P46663
Residue:
353
  
Inhibitor
Name:
BDBM140547
Synonyms:
US8912221, 20
Type:
Small organic molecule
Emp. Form.:
C24H21ClF2N8O4
Mol. Mass.:
558.925
SMILES:
C[C@@H](NC(=O)C1(COC1)NC(=O)c1cc(C)no1)c1ncc(cc1F)-c1cc(Cl)cc(F)c1-c1nnn(C)n1
: