Target
B1 bradykinin receptor
Ligand
BDBM140552
Substrate
Meas. Tech.
Binding Assay
pH
7.4±n/a
Ki
1±n/a nM
Comments
extracted
Citation
 Aebi, JBinggeli, AHertel, CKonkar, AAKuehne, HKuhn, BMaerki, HPWang, H Biaryl amide derivatives US Patent  US8912221 Publication Date 12/16/2014 
Target
Name:
B1 bradykinin receptor
Synonyms:
B1 BRADYKININ B1R BK-1 receptor BRADYB1 | Bradykinin B1 receptor
Type:
Enzyme
Mol. Mass.:
40508.87
Organism:
Homo sapiens (Human)
Description:
P46663
Residue:
353
  
Inhibitor
Name:
BDBM140552
Synonyms:
US8912221, 25
Type:
Small organic molecule
Emp. Form.:
C25H20ClF2N7O4
Mol. Mass.:
555.921
SMILES:
C[C@@H](NC(=O)C1(COC1)NC(=O)c1ccnnc1)c1ncc(cc1F)-c1cc(Cl)cc(F)c1-c1noc(C)n1
: